{"text_format":"1","workbook":"xlsx","n_sheets":5,"sheets":["Vista Principal","Feriados","Proceso Prima de Seguro","TarifarioBD","CostoCapBD"],"not_rendered":{"charts":0,"images":0,"macros":1,"external_links":0,"defined_names":5,"comments":3,"pivot_tables":0},"unopened":[],"bounds":{"document_bytes":16777216,"sheet_cells":100000,"rows_first":2000,"rows_last":500,"rows_between":2000,"halvings":0,"cell_chars":16384,"cell_head_chars":4096},"cells_cut":0,"cells_raw":0,"read":"whole","date_system":"1900"}

{"sheet":"Vista Principal","index":0,"n_rows":398,"n_cols":26,"rows_kept":398,"cut":false,"hidden":false,"merged":[[397,1,401,12],[1,1,3,12],[9,8,9,9],[10,8,10,9],[11,8,11,9]]}
[]
[null,"Simulador Préstamo Personal Libre Disponibilidad"]
[]
[]
[]
[]
[null,"1) Establecer los datos del préstamos"]
[]
[null,"Producto","Préstamos Personales (LD )"]
[null,"Tipo de Seguro","Seguro de Desgravamen",null,null,null,null,null,"Seguro Tasa de Prima Mensual (%)",null,null,null,{"$f":"IF(C10=\"Seguro de Vida\",\"\",'Proceso Prima de Seguro'!C13)","v":6.6010000000000001E-3}]
[null,"Tarifa","TARIFA TITULAR",null,null,null,null,null,"Costo de Capital Mensual",null,null,null,{"$f":"Tabla2[CostoCapital]","v":2.8709999999999999E-3}]
[null,"MAF Inicial",5000,null,null,null,null,null,"Días Cobertura Seguro",null,null,null,{"$f":"'Proceso Prima de Seguro'!C19","v":371}]
[null,"Seguro Desempleo",0]
[null,"Monto adicional desempleo",{"$f":"C13*C12","v":0}]
[null,"Prima Única (%) del Seguro ",{"$f":"IF(C10=\"Seguro de vida\",'Proceso Prima de Seguro'!C13,'Proceso Prima de Seguro'!H16)","v":4.9064709137886998E-2}]
[null,"Prima Única (S/) del Seguro",{"$f":"+C15*C12","v":245.32354568943498}]
[null,"MAF Final",{"$f":"C12+C14+C16","v":5245.3235456894354}]
[null,"Empleado",{"$f":"IF(OR(C9=\"Préstamos Personales (LD Y PA) (Empleados)\",C9 = \"Préstamos Vehiculares (Empleados)\"),\"SI\",\"NO\")","v":"NO"}]
[null,"Moneda","Soles"]
[null,"Plazo ",12]
[null,"Fecha de Desembolso","2024-04-01",null,null,null,null,{"$f":"C22-C21","v":35},"Días de Periodo de Gracia"]
[null,"Fecha de 1er Pago","2024-05-06"]
[null,"Cuota Julio",1]
[null,"Cuota Diciembre",1]
[null,"TEA",0.83399999999999996]
[null,"TEA TOTAL",{"$f":"+C25","v":0.83399999999999996}]
[null,"Monto del Bien",0]
[null,"Seguro del Bien",0]
[null,"Portes",0]
[null,"Cuota",{"$f":"(C17+(C28*C27+C29)*P34)/O34","v":606.19433527269268}]
[null,"2) Calcular TCEA presionando el botón "]
[null,"TCEA",1.0147655204928381]
[null,null,null,null,null,null,null,null,null,null,null,null,null,null,null,null,null,null,null,null,{"$f":"C17-U34-C14-C16","v":3.979039320256561E-13}]
[null,null,null,null,null,null,null,null,null,null,null,null,null,null,{"$f":"SUM(O36:O395)","v":8.6528745659258917},{"$f":"SUM(P36:P395)","v":8.6528745659258917},null,null,null,null,{"$f":"SUM(U36:U395)","v":5000}]
[null,"N° Cuota","Fecha de pago","Día","Fecha de pago Prev","Días","Dias Acumulados","Saldo Inicial","Amortización","Interés","Seguro del Bien","Portes","Cuota ","Saldo Final","Factor Cronograma","Factor Cronograma 2",null,"Vector i,1\nCuota","Vector i,2\nDías Acum","Vector i,3 Factor","Vector i,4\nCalculo VA",null,null,null,null,"Feriados"]
[null,1,{"$f":"IF(D36=7,E36+1,E36)","v":"2024-05-06"},{"$f":"IF(B36<=$C$20,WEEKDAY(E36,2),\"\")","v":1},{"$f":"C22","v":"2024-05-06"},{"$f":"C36-C21","v":35},{"$f":"F36","v":35},{"$f":"C17","v":5245.3235456894354},{"$f":"IF(B36>C$20,\"\",M36-L36-K36-J36)","v":287.60206762626558},{"$f":"IF(B36>C$20,\"\",((1+C$25)^(F36/360)-1)*H36)","v":318.5922676464271},{"$f":"IF(B36>C$20,\"\",C$27*C$28)","v":0},{"$f":"IF(B36>C$20,\"\",C$29)","v":0},{"$f":"IF(B36>C$20,\"\",IF(B36=C$20,H36+J36+K36+L36,IF(AND(C$23=2,MONTH(C36)=7),2*C$30,IF(AND(C$24=2,MONTH(C36)=12),2*C$30,C$30))))","v":606.19433527269268},{"$f":"IF(B36>C$20,\"\",H36-I36)","v":4957.7214780631693},{"$f":"IFERROR(IF(AND(MONTH(C36)=7,C$23=2),2/(1+C$26)^(G36/360),IF(AND(MONTH(C36)=12,C$24=2),2/(1+C$26)^(G36/360),1/(1+C$26)^(G36/360))),\"\")","v":0.9427395599906796},{"$f":"IFERROR(1/(1+C$26)^(G36/360),\"\")","v":0.9427395599906796},null,{"$f":"IFERROR(I36+J36+K36+L36,\"\")","v":606.19433527269268},{"$f":"G36","v":35},{"$f":"IFERROR((1+C$32)^(S36/360),\"\")","v":1.0704771043307455},{"$f":"IFERROR(ROUND(R36/T36,2),\"\")","v":566.28}]
[null,{"$f":"IF(B36>=$C$20,\"\",B36+1)","v":2},{"$f":"IF(D37=7,E37+1,E37)","v":"2024-06-06"},{"$f":"IF(B37<=$C$20,WEEKDAY(E37,2),\"\")","v":4},{"$f":"IF(B37>$C$20,\"\",IF(WEEKDAY(Z37,2)=7,Z37+1,Z37))","v":"2024-06-06"},{"$f":"C37-C22","v":31},{"$f":"IFERROR(F37+G36,\"\")","v":66},{"$f":"IF(B37>C$20,\"\",N36)","v":4957.7214780631693},340.39013746840504,265.80419780428764,0,0,606.19433527269268,4617.3313405947647,0.89476733815603238,0.89476733815603238,null,{"$f":"IFERROR(I37+J37+K37+L37,\"\")","v":606.19433527269268},66,1.1370367285695648,533.14,null,null,null,null,{"$f":"IF(B37>$C$20,\"\",IF(COUNTIF(Feriados!A2:A17,EDATE($C$36,B36))=0,EDATE($C$36,B36),EDATE($C$36,B36)+VLOOKUP(EDATE($C$36,B36),Feriados!$A$2:$B$17,2,FALSE)))","v":"2024-06-06"}]
[null,{"$f":"IF(B37>=$C$20,\"\",B37+1)","v":3},"2024-07-06",{"$f":"IF(B38<=$C$20,WEEKDAY(E38,2),\"\")","v":6},{"$f":"IF(B38>$C$20,\"\",IF(WEEKDAY(Z38,2)=7,Z38+1,Z38))","v":"2024-07-06"},{"$f":"IF(B38>C$20,\"\",C38-C37)","v":30},96,4617.3313405947647,366.82895002557962,239.3653852471131,0,0,606.19433527269268,4250.5023905691851,0.85066816114449539,0.85066816114449539,null,606.19433527269268,96,1.2053870906773911,502.9,null,null,null,null,{"$f":"IF(B38>$C$20,\"\",IF(COUNTIF(Feriados!A3:A18,EDATE($C$36,B37))=0,EDATE($C$36,B37),EDATE($C$36,B37)+VLOOKUP(EDATE($C$36,B37),Feriados!$A$2:$B$17,2,FALSE)))","v":"2024-07-06"}]
[null,4,"2024-08-07",{"$f":"IF(B39<=$C$20,WEEKDAY(E39,2),\"\")","v":3},{"$f":"IF(B39>$C$20,\"\",IF(WEEKDAY(Z39,2)=7,Z39+1,Z39))","v":"2024-08-07"},32,128,4250.5023905691851,370.75591889542528,235.4384163772674,0,0,606.19433527269268,3879.74647167376,0.80602201592289779,0.80602201592289779,null,606.19433527269268,128,1.2828288390468534,472.54,null,null,null,null,{"$f":"IF(B39>$C$20,\"\",IF(COUNTIF(Feriados!A4:A19,EDATE($C$36,B38))=0,EDATE($C$36,B38),EDATE($C$36,B38)+VLOOKUP(EDATE($C$36,B38),Feriados!$A$2:$B$17,2,FALSE)))","v":"2024-08-07"}]
[null,5,"2024-09-06",5,"2024-09-06",30,158,3879.74647167376,405.06581744496987,201.12851782772279,0,0,606.19433527269268,3474.68065422879,0.76629670852775766,0.76629670852775766,null,606.19433527269268,158,1.3599431603946974,445.75,null,null,null,null,{"$f":"IF(B40>$C$20,\"\",IF(COUNTIF(Feriados!A5:A20,EDATE($C$36,B39))=0,EDATE($C$36,B39),EDATE($C$36,B39)+VLOOKUP(EDATE($C$36,B39),Feriados!$A$2:$B$17,2,FALSE)))","v":"2024-09-06"}]
{"$rows_left_out":359}
{"sheet":"Feriados","index":1,"n_rows":18,"n_cols":2,"rows_kept":18,"cut":false,"hidden":true,"merged":[]}
["Feriados del Año 2024","Cantidad días"]
["2024-01-01",1]
["2024-03-28",2]
["2024-03-29",1]
["2024-05-01",1]
["2024-06-07",1]
["2024-06-29",1]
["2024-07-23",1]
["2024-07-28",1]
["2024-07-29",2]
["2024-08-06",1]
["2024-08-30",1]
["2024-10-08",1]
["2024-11-01",1]
["2024-12-08",3]
["2024-12-09",2]
["2024-12-25",1]
["2025-01-01",1]

{"sheet":"Proceso Prima de Seguro","index":2,"n_rows":397,"n_cols":25,"rows_kept":397,"cut":false,"hidden":true,"merged":[[1,2,3,9]]}
[]
[null,null,"Proceso de Cálculo de la Prima de Seguros"]
[]
[]
[]
[]
[null,"1) Datos esenciales del préstamo",null,null,null,null,"3) Calculo del valor presente del Seguro"]
[]
[null,"Producto",{"$f":"'Vista Principal'!C9","v":"Préstamos Personales (LD )"},null,null,null,"Suma de Prima Mensual",{"$f":"SUM(L38:L397)","v":248.72467912525894}]
[null,"Tipo de Seguro",{"$f":"'Vista Principal'!C10","v":"Seguro de Desgravamen"},null,null,null,"VPN - Valor Presente",{"$f":"NPV(C16,L38:L397)","v":245.32354568943501}]
[null,"Tarifa",{"$f":"'Vista Principal'!C11","v":"TARIFA TITULAR"}]
[null,"Monto inicial",{"$f":"'Vista Principal'!C12","v":5000},null,null,null,"4) Calculo del Monto Adicional del Seguro y MAF"]
[null,{"$f":"C10","v":"Seguro de Desgravamen"},{"$f":"INDEX(_xlfn._xlws.FILTER(TarifarioPrincipal[],(TarifarioPrincipal[TARIFA]='Proceso Prima de Seguro'!C11)*(TarifarioPrincipal[PRODUCTO]='Proceso Prima de Seguro'!C9)*(TarifarioPrincipal[TIPO_SEGURO]='Proceso Prima de Seguro'!C10)*(TarifarioPrincipal[Plazo]='Proceso Prima de Seguro'!C20)),0,5)","v":6.6010000000000001E-3}]
[null,"Monto adicional Seguro de Desgravamen/ Vida",null,null,null,null,"Monto inicial",{"$f":"C12","v":5000}]
[null,"MAF Inicial",{"$f":"C12+C14","v":5000},null,null,null,"Monto adicional de Desgravamen / Vida",{"$f":"H10","v":245.32354568943501}]
[null,"Costo Capital",{"$f":"INDEX(_xlfn._xlws.FILTER(Tabla2[],Tabla2[TARIFA]=C11),0,2)","v":2.8709999999999999E-3},null,null,null,"Prima de Seguro de Desgravamen / Vida",{"$f":"H15/H14","v":4.9064709137886998E-2}]
[null,"Moneda",{"$f":"'Vista Principal'!C19","v":"Soles"},null,null,null,"MAF Inicial",{"$f":"H14+H15","v":5245.3235456894354}]
[null,"Plazo Remanente Meses",{"$f":"'Vista Principal'!C20","v":12}]
[null,"Plazo en Días",{"$f":"(OFFSET(C37,(COUNT(C38:C397)),0))-$C$21","v":371}]
[null,"Plazo Rango",{"$f":"IF(C19<=370,\"0-370\",IF(AND(C19>=371,C19<=553),\"371-553\",IF(AND(C19>=554,C19<=736),\"554-736\",IF(AND(C19>=737,C19<=1101),\"737-1101\",IF(AND(C19>=1102,C19<=1466),\"1102-1466\",IF(AND(C19>=1467,C19<=1831),\"1467-1831\",\"1832-2257\"))))))","v":"371-553"}]
[null,"Fecha de Desembolso",{"$f":"'Vista Principal'!C21","v":"2024-04-01"}]
[null,"Fecha de 1er Pago",{"$f":"'Vista Principal'!C22","v":"2024-05-06"}]
[null,"Cuota Julio",{"$f":"'Vista Principal'!C23","v":1}]
[null,"Cuota Diciembre",{"$f":"'Vista Principal'!C24","v":1}]
[null,"TEA",{"$f":"'Vista Principal'!C25","v":0.83399999999999996}]
[null,"TEA TOTAL",{"$f":"(1+(((1+C25)^(30/360)-1)+C13))^12-1","v":0.97698318770659665}]
[null,"Monto del Bien",0]
[null,"Seguro del Bien",0]
[null,"Portes",0]
[null,"Cuota",{"$f":"(C15+(C28*C27+C29)*R36)/Q36","v":600.40998448646394}]
[]
[null,"TCEA",0.9236764757563436]
[null,null,null,null,null,null,null,null,null,null,null,null,null,null,null,null,null,null,null,null,null,null,{"$f":"C15-W36-C14","v":-69.470000000000255}]
[]
[null,"2) Creación de Cronograma de prima mensual"]
[null,null,null,null,null,null,null,null,null,null,null,null,null,null,null,null,{"$f":"SUM(Q38:Q397)","v":8.3276429926070357},{"$f":"SUM(R38:R397)","v":8.3276429926070357},null,null,null,null,{"$f":"SUM(W38:W397)","v":5069.47}]
[null,"N° Cuota","Fecha de pago","Día","Fecha de pago","Feriados","Días","Dias Acumulados","Saldo Inicial","Amortización","Interés","Seguro Desgravamen","Seguro del Bien","Portes","Cuota Constante","Saldo Final","Factor Cronograma","Factor Cronograma 2",null,"Vector i,1\nCuota","Vector i,2\nDías Acum","Vector i,3 Factor","Vector i,4\nCalculo VA","VPN - Valor Presente","VPN - Valor Presente"]
[null,1,{"$f":"C22","v":"2024-05-06"},{"$f":"IF(B38<=$C$18,WEEKDAY(C38,2),\"\")","v":1},{"$f":"IF(D38=7,C38+1,C38)","v":"2024-05-06"},null,{"$f":"E38-C21","v":35},{"$f":"G38","v":35},{"$f":"C15","v":5000},{"$f":"IF(B38>C$18,\"\",O38-N38-M38-L38-K38)","v":258.19128680159213},{"$f":"IF(B38>C$18,\"\",((1+C$25)^(G38/360)-1)*I38)","v":303.69172165580108},{"$f":"IF(B38>C$18,\"\",((1+C$13)^(G38/30)-1)*I38)","v":38.526976029070738},{"$f":"IF(B38>C$18,\"\",C$27*C$28)","v":0},{"$f":"IF(B38>C$18,\"\",C$29)","v":0},{"$f":"IF(B38>C$18,\"\",IF(B38=C$18,I38+K38+L38+M38+N38,IF(AND(C$23=2,MONTH(E38)=7),2*C$30,IF(AND(C$24=2,MONTH(E38)=12),2*C$30,C$30))))","v":600.40998448646394},{"$f":"IF(B38>C$18,\"\",I38-J38)","v":4741.8087131984075},{"$f":"IFERROR(IF(AND(MONTH(E38)=7,C$23=2),2/(1+C$26)^(H38/360),IF(AND(MONTH(E38)=12,C$24=2),2/(1+C$26)^(H38/360),1/(1+C$26)^(H38/360))),\"\")","v":0.93588380669772542},{"$f":"IFERROR(1/(1+C$26)^(H38/360),\"\")","v":0.93588380669772542},null,{"$f":"IFERROR(J38+K38+L38+M38+N38,\"\")","v":600.40998448646394},{"$f":"H38","v":35},{"$f":"IFERROR((1+C$32)^(U38/360),\"\")","v":1.0656729636205533},{"$f":"IFERROR(ROUND(T38/V38,2),\"\")","v":563.41},{"$f":"L38/(1+$I$9)","v":38.526976029070738},{"$f":"L38/(1+$Q$30)","v":38.526976029070738}]
[null,2,{"$f":"IF(B39>$C$18,\"\",IF(WEEKDAY(F39,2)=7,F39+1,F39))","v":"2024-06-06"},4,{"$f":"IF(D39=7,C39+1,C39)","v":"2024-06-06"},{"$f":"IF(B38>$C$18,\"\",IF(COUNTIF(Feriados!$A$2:$B$18,EDATE($C$38,B38))=0,EDATE($C$38,B38),EDATE($C$38,B38)+VLOOKUP(EDATE($C$38,B38),Feriados!$A$2:$B$18,2,FALSE)))","v":"2024-06-06"},{"$f":"IF(B39>C$18,\"\",E39-E38)","v":31},{"$f":"IFERROR(G39+H38,\"\")","v":66},{"$f":"IF(B39>C$18,\"\",P38)","v":4741.8087131984075},{"$f":"IF(B39>C$18,\"\",O39-N39-M39-L39-K39)","v":313.8341875263601},254.22821082831001,{"$f":"IF(B39>C$18,\"\",((1+C$13)^(G39/30)-1)*I39)","v":32.347586131793818},0,0,600.40998448646394,4427.9745256720471,0.88253672700434982,0.88253672700434982,null,600.40998448646394,66,1.1274333386202915,532.54999999999995,{"$f":"IF(O39=\"\",0,L39/((1+$I$9)^B39))","v":32.347586131793818},{"$f":"IF(O39=\"\",0,L39/((1+$Q$30)^B39))","v":32.347586131793818}]
[null,3,{"$f":"IF(B40>$C$18,\"\",IF(WEEKDAY(F40,2)=7,F40+1,F40))","v":"2024-07-06"},6,"2024-07-06",{"$f":"IF(B39>$C$18,\"\",IF(COUNTIF(Feriados!$A$2:$B$18,EDATE($C$38,B39))=0,EDATE($C$38,B39),EDATE($C$38,B39)+VLOOKUP(EDATE($C$38,B39),Feriados!$A$2:$B$18,2,FALSE)))","v":"2024-07-06"},30,96,4427.9745256720471,341.63191678088231,229.54900786162008,29.229059843961533,0,0,600.40998448646394,4086.3426088911647,0.83380764554694675,0.83380764554694675,null,600.40998448646394,96,1.190607303860109,504.29,29.229059843961533,29.229059843961533]
{"$rows_left_out":358}
{"sheet":"TarifarioBD","index":3,"n_rows":22,"n_cols":9,"rows_kept":22,"cut":false,"hidden":true,"merged":[]}
["TARIFA","PRODUCTO","TIPO_SEGURO","Plazo","Valor",null,"TARIFA","PRODUCTO","TIPO_SEGURO"]
["TARIFA TITULAR","Préstamos Personales (LD )","Seguro de Vida","0-370",5.3999999999999999E-2,null,"TARIFA TITULAR","Préstamos Personales (LD )","Seguro de Vida"]
["TARIFA TITULAR","Préstamos Personales (LD )","Seguro de Vida","371-553",5.8999999999999997E-2,null,null,null,"Seguro de Desgravamen"]
["TARIFA TITULAR","Préstamos Personales (LD )","Seguro de Vida","554-736",6.4000000000000001E-2,null,null,null,"Seguro de Desgravamen con Devolución"]
["TARIFA TITULAR","Préstamos Personales (LD )","Seguro de Vida","737-1101",6.8000000000000005E-2]
["TARIFA TITULAR","Préstamos Personales (LD )","Seguro de Vida","1102-1466",7.3999999999999996E-2]
["TARIFA TITULAR","Préstamos Personales (LD )","Seguro de Vida","1467-1831",8.1000000000000003E-2]
["TARIFA TITULAR","Préstamos Personales (LD )","Seguro de Vida","1832-2257",8.1000000000000003E-2]
["TARIFA TITULAR","Préstamos Personales (LD )","Seguro de Desgravamen","0-370",8.3140000000000002E-3]
["TARIFA TITULAR","Préstamos Personales (LD )","Seguro de Desgravamen","371-553",6.6010000000000001E-3]
["TARIFA TITULAR","Préstamos Personales (LD )","Seguro de Desgravamen","554-736",5.0809999999999996E-3]
["TARIFA TITULAR","Préstamos Personales (LD )","Seguro de Desgravamen","737-1101",3.7880000000000001E-3]
["TARIFA TITULAR","Préstamos Personales (LD )","Seguro de Desgravamen","1102-1466",2.9420000000000002E-3]
["TARIFA TITULAR","Préstamos Personales (LD )","Seguro de Desgravamen","1467-1831",2.529E-3]
["TARIFA TITULAR","Préstamos Personales (LD )","Seguro de Desgravamen","1832-2257",2.0460000000000001E-3]
["TARIFA TITULAR","Préstamos Personales (LD )","Seguro de Desgravamen con Devolución","0-370",1.0884E-2]
["TARIFA TITULAR","Préstamos Personales (LD )","Seguro de Desgravamen con Devolución","371-553",8.5489999999999993E-3]
["TARIFA TITULAR","Préstamos Personales (LD )","Seguro de Desgravamen con Devolución","554-736",6.6210000000000001E-3]
["TARIFA TITULAR","Préstamos Personales (LD )","Seguro de Desgravamen con Devolución","737-1101",4.9240000000000004E-3]
["TARIFA TITULAR","Préstamos Personales (LD )","Seguro de Desgravamen con Devolución","1102-1466",3.8319999999999999E-3]
["TARIFA TITULAR","Préstamos Personales (LD )","Seguro de Desgravamen con Devolución","1467-1831",3.2910000000000001E-3]
["TARIFA TITULAR","Préstamos Personales (LD )","Seguro de Desgravamen con Devolución","1832-2257",2.663E-3]

{"sheet":"CostoCapBD","index":4,"n_rows":2,"n_cols":2,"rows_kept":2,"cut":false,"hidden":true,"merged":[]}
["TARIFA","CostoCapital"]
["TARIFA TITULAR",2.8709999999999999E-3]